Target
Hypoxia-inducible factor 1-alpha inhibitor
Ligand
BDBM50304610
Substrate
Meas. Tech.
ChEMBL_606822 (CHEMBL1068586)
IC50
32100±n/a nM
Citation
 Ko, SLee, MKShin, DPark, H Structure-based virtual screening approach to the discovery of novel inhibitors of factor-inhibiting HIF-1: identification of new chelating groups for the active-site ferrous ion. Bioorg Med Chem 17:7769-74 (2009)  
Target
Name:
Hypoxia-inducible factor 1-alpha inhibitor
Synonyms:
FIH1 HIF1N_HUMAN Hypoxia-inducible factor 1-alpha inhibitor
Type:
Enzyme
Mol. Mass.:
40278.92
Organism:
Homo sapiens (Human)
Description:
Q9NWT6
Residue:
349
  
Inhibitor
Name:
BDBM50304610
Synonyms:
3-(5-(2-methoxybenzylidene)-4-oxo-2-thioxothiazolidin-3-yl)-N-(4-sulfamoylphenyl)propanamide | CHEMBL607142
Type:
Small organic molecule
Emp. Form.:
C20H19N3O5S3
Mol. Mass.:
477.577
SMILES:
COc1ccccc1\C=C1/SC(=S)N(CCC(=O)Nc2ccc(cc2)S(N)(=O)=O)C1=O
: