Target
Prostaglandin E synthase
Ligand
BDBM31121
Substrate
Meas. Tech.
ChEMBL_604678 (CHEMBL1068501)
IC50
1600±n/a nM
Citation
 Koeberle, AHaberl, EMRossi, APergola, CDehm, FNorthoff, HTroschuetz, RSautebin, LWerz, O Discovery of benzo[g]indol-3-carboxylates as potent inhibitors of microsomal prostaglandin E(2) synthase-1. Bioorg Med Chem 17:7924-32 (2009)  
Target
Name:
Prostaglandin E synthase
Synonyms:
MGST1L1 PGES PTGES Prostaglandin E synthase (PGES-1) Prostaglandin E synthase-1 (PGES-1) Prostaglandin E2 synthase-1 ( mPGES-1)
Type:
Protein
Mol. Mass.:
17112.22
Organism:
Homo sapiens (Human)
Description:
Residue:
152
  
Inhibitor
Name:
BDBM31121
Synonyms:
5-hydroxy-1H-benzo[g]indole-3-carboxylate, 14
Type:
Small organic molecule
Emp. Form.:
C21H17ClN2O3
Mol. Mass.:
380.824
SMILES:
CCOC(=O)c1c(Nc2cccc(Cl)c2)[nH]c2c1cc(O)c1ccccc21
: