Target
Glutamate carboxypeptidase 2
Ligand
BDBM50304738
Substrate
Meas. Tech.
ChEMBL_605563 (CHEMBL1067317)
Ki
0.75±n/a nM
Citation
 Wang, HByun, YBarinka, CPullambhatla, MBhang, HEFox, JJLubkowski, JMease, RCPomper, MG Bioisosterism of urea-based GCPII inhibitors: Synthesis and structure-activity relationship studies. Bioorg Med Chem Lett 20:392-7 (2010)  
Target
Name:
Glutamate carboxypeptidase 2
Synonyms:
FGCP FOLH1 Folate hydrolase 1 Glutamate carboxypeptidase 2 Membrane glutamate carboxypeptidase NAALAD1 PSM Prostate-specific membrane antigen mGCP
Type:
PROTEIN
Mol. Mass.:
84333.66
Organism:
Homo sapiens (Human)
Description:
ChEMBL_1497035
Residue:
750
  
Inhibitor
Name:
BDBM50304738
Synonyms:
2-(3-((S)-1-carboxy-3-methylbutyl)ureido)pentanedioic acid US20230414794, Compound ZJ-43
Type:
Small organic molecule
Emp. Form.:
C12H20N2O7
Mol. Mass.:
304.2964
SMILES:
CC(C)C[C@H](NC(=O)N[C@@H](CCC(O)=O)C(O)=O)C(O)=O
: