Target
Glutamate carboxypeptidase 2
Ligand
BDBM50304750
Substrate
Meas. Tech.
ChEMBL_605563 (CHEMBL1067317)
Ki
318±n/a nM
Citation
 Wang, HByun, YBarinka, CPullambhatla, MBhang, HEFox, JJLubkowski, JMease, RCPomper, MG Bioisosterism of urea-based GCPII inhibitors: Synthesis and structure-activity relationship studies. Bioorg Med Chem Lett 20:392-7 (2010)  
Target
Name:
Glutamate carboxypeptidase 2
Synonyms:
FGCP FOLH1 Folate hydrolase 1 Glutamate carboxypeptidase 2 Membrane glutamate carboxypeptidase NAALAD1 PSM Prostate-specific membrane antigen mGCP
Type:
PROTEIN
Mol. Mass.:
84333.66
Organism:
Homo sapiens (Human)
Description:
ChEMBL_1497035
Residue:
750
  
Inhibitor
Name:
BDBM50304750
Synonyms:
(S)-1-(3-(1-Carboxy-5-(4-iodobenzamido)pentyl)ureido)cyclopropanecarboxylic acid | CHEMBL593155
Type:
Small organic molecule
Emp. Form.:
C18H22IN3O6
Mol. Mass.:
503.2883
SMILES:
OC(=O)[C@H](CCCCNC(=O)c1ccc(I)cc1)NC(=O)NC1(CC1)C(O)=O
: