Target
Histone deacetylase 7
Ligand
BDBM50304783
Substrate
Meas. Tech.
ChEMBL_605916 (CHEMBL1068533)
IC50
102±n/a nM
Citation
 Angibaud, PVan Emelen, KDecrane, Lvan Brandt, STen Holte, PPilatte, IRoux, BPoncelet, VSpeybrouck, DQueguiner, LGaurrand, SMariën, AFloren, WJanssen, LVerdonck, Mvan Dun, Jvan Gompel, JGilissen, RMackie, CDu Jardin, MPeeters, JNoppe, MVan Hijfte, LFreyne, EPage, MJanicot, MArts, J Identification of a series of substituted 2-piperazinyl-5-pyrimidylhydroxamic acids as potent histone deacetylase inhibitors. Bioorg Med Chem Lett 20:294-8 (2010)  
Target
Name:
Histone deacetylase 7
Synonyms:
HD7 HDAC7A Histone acetylase 7 (HDAC7) Human HDAC7
Type:
Chromatin regulator; hydrolase; repressor
Mol. Mass.:
102942.62
Organism:
Homo sapiens (Human)
Description:
Q8WUI4
Residue:
952
  
Inhibitor
Name:
BDBM50304783
Synonyms:
(+)-2-(4-(4-(4-fluorophenyl)-1-hydroxybut-3-en-2-yl)piperazin-1-yl)-N-hydroxypyrimidine-5-carboxamide 2-(4-(4-(4-fluorophenyl)-1-hydroxybut-3-en-2-yl)piperazin-1-yl)-N-hydroxypyrimidine-5-carboxamide | CHEMBL594544
Type:
Small organic molecule
Emp. Form.:
C19H22FN5O3
Mol. Mass.:
387.4081
SMILES:
OCC(\C=C\c1ccc(F)cc1)N1CCN(CC1)c1ncc(cn1)C(=O)NO
: