Target
Cannabinoid receptor 1
Ligand
BDBM50277339
Substrate
Meas. Tech.
ChEMBL_606627 (CHEMBL1071854)
Ki
3400±n/a nM
Citation
 Sellitto, ILe Bourdonnec, BWorm, KGoodman, ASavolainen, MAChu, GHAjello, CWSaeui, CTLeister, LKCassel, JADehaven, RNLabuda, CJKoblish, MLittle, PJBrogdon, BLSmith, SADolle, RE Novel sulfamoyl benzamides as selective CB(2) agonists with improved in vitro metabolic stability. Bioorg Med Chem Lett 20:387-91 (2010)  
Target
Name:
Cannabinoid receptor 1
Synonyms:
CANN6 CB-R CNR CNR1_HUMAN Cannabinoid receptor Cannabinoid receptor 1 (brain)
Type:
G Protein-Coupled Receptor (GPCR)
Mol. Mass.:
52868.96
Organism:
Homo sapiens (Human)
Description:
P21554
Residue:
472
  
Inhibitor
Name:
BDBM50277339
Synonyms:
2,2,3,3-tetramethyl-N-(4-methyl-3-(morpholinosulfonyl)phenyl)cyclopropanecarboxamide | CHEMBL472856
Type:
Small organic molecule
Emp. Form.:
C19H28N2O4S
Mol. Mass.:
380.502
SMILES:
Cc1ccc(NC(=O)C2C(C)(C)C2(C)C)cc1S(=O)(=O)N1CCOCC1
: