Target
Cannabinoid receptor 2
Ligand
BDBM50304916
Substrate
Meas. Tech.
ChEMBL_606628 (CHEMBL1071855)
Ki
6.6±n/a nM
Citation
 Sellitto, ILe Bourdonnec, BWorm, KGoodman, ASavolainen, MAChu, GHAjello, CWSaeui, CTLeister, LKCassel, JADehaven, RNLabuda, CJKoblish, MLittle, PJBrogdon, BLSmith, SADolle, RE Novel sulfamoyl benzamides as selective CB(2) agonists with improved in vitro metabolic stability. Bioorg Med Chem Lett 20:387-91 (2010)  
Target
Name:
Cannabinoid receptor 2
Synonyms:
CANNABINOID CB2 CB2 CB2B CNR2_HUMAN Cannabinoid CB2 receptor Cannabinoid receptor 2 (CB2R) | hCB2
Type:
G Protein-Coupled Receptor (GPCR)
Mol. Mass.:
39690.94
Organism:
Homo sapiens (Human)
Description:
P34972
Residue:
360
  
Inhibitor
Name:
BDBM50304916
Synonyms:
CHEMBL593625 | N-(3,4-dimethyl-5-(morpholinosulfonyl)phenyl)-3,3,3-trifluoro-2-methyl-2-(trifluoromethyl)propanamide
Type:
Small organic molecule
Emp. Form.:
C17H20F6N2O4S
Mol. Mass.:
462.407
SMILES:
Cc1cc(NC(=O)C(C)(C(F)(F)F)C(F)(F)F)cc(c1C)S(=O)(=O)N1CCOCC1
: