Target
Cannabinoid receptor 2
Ligand
BDBM50304926
Substrate
Meas. Tech.
ChEMBL_606629 (CHEMBL1071856)
EC50
13±n/a nM
Citation
 Sellitto, ILe Bourdonnec, BWorm, KGoodman, ASavolainen, MAChu, GHAjello, CWSaeui, CTLeister, LKCassel, JADehaven, RNLabuda, CJKoblish, MLittle, PJBrogdon, BLSmith, SADolle, RE Novel sulfamoyl benzamides as selective CB(2) agonists with improved in vitro metabolic stability. Bioorg Med Chem Lett 20:387-91 (2010)  
Target
Name:
Cannabinoid receptor 2
Synonyms:
CANNABINOID CB2 CB2 Cannabinoid CB2 receptor Cnr2 | rCB2
Type:
Enzyme
Mol. Mass.:
39366.68
Organism:
Rattus norvegicus (Rat)
Description:
Q9QZN9
Residue:
360
  
Inhibitor
Name:
BDBM50304926
Synonyms:
CHEMBL602105 | N-(3,4-dimethyl-5-(piperidin-1-ylsulfonyl)phenyl)-2,2-dimethylbutanamide
Type:
Small organic molecule
Emp. Form.:
C19H30N2O3S
Mol. Mass.:
366.518
SMILES:
CCC(C)(C)C(=O)Nc1cc(C)c(C)c(c1)S(=O)(=O)N1CCCCC1
: