Target
MAP/microtubule affinity-regulating kinase 3
Ligand
BDBM50305006
Substrate
Meas. Tech.
ChEMBL_606919 (CHEMBL1072662)
IC50
210±n/a nM
Citation
 Harris, CMEricsson, AMArgiriadi, MABarberis, CBorhani, DWBurchat, ACalderwood, DJCunha, GADixon, RWFrank, KEJohnson, EFKamens, JKwak, SLi, BMullen, KDPerron, DCWang, LWishart, NWu, XZhang, XZmetra, TRTalanian, RV 2,4-Diaminopyrimidine MK2 inhibitors. Part II: Structure-based inhibitor optimization. Bioorg Med Chem Lett 20:334-7 (2010)  
Target
Name:
MAP/microtubule affinity-regulating kinase 3
Synonyms:
2.7.11.1 CTAK1 ELKL motif kinase 2 EMK2 MAP/microtubule affinity-regulating kinase 3 (MARK 3) MARK3_HUMAN Protein kinase STK10 Serine/threonine-protein kinase c-TAK1 | Serine/threonine-protein kinase p78
Type:
Protein
Mol. Mass.:
84525.94
Organism:
Homo sapiens (Human)
Description:
P27448
Residue:
753
  
Inhibitor
Name:
BDBM50305006
Synonyms:
5-(2-aminoethyl)-7-(7-(benzo[b]thiophen-2-yl)-1H-indazol-5-yl)-5H-pyrrolo[3,2-d]pyrimidin-2-amine | CHEMBL590109
Type:
Small organic molecule
Emp. Form.:
C23H19N7S
Mol. Mass.:
425.509
SMILES:
NCCn1cc(-c2cc(-c3cc4ccccc4s3)c3[nH]ncc3c2)c2nc(N)ncc12
: