Target
Cytochrome P450 3A4
Ligand
BDBM50158528
Substrate
Meas. Tech.
ChEMBL_603292 (CHEMBL1049516)
IC50
400±n/a nM
Citation
 Goulet, SPoupart, MAGillard, JPoirier, MKukolj, GBeaulieu, PL Discovery of benzimidazole-diamide finger loop (Thumb Pocket I) allosteric inhibitors of HCV NS5B polymerase: Implementing parallel synthesis for rapid linker optimization. Bioorg Med Chem Lett 20:196-200 (2010)  
Target
Name:
Cytochrome P450 3A4
Synonyms:
Albendazole monooxygenase CP3A4_HUMAN CYP3A4 CYPIIIA4 Cytochrome P450 3A4 (CYP3A4) Nifedipine oxidase Taurochenodeoxycholate 6-alpha-hydroxylase
Type:
Enzyme
Mol. Mass.:
57349.57
Organism:
Homo sapiens (Human)
Description:
Residue:
503
  
Inhibitor
Name:
BDBM50158528
Synonyms:
(S)-1-cyclohexyl-2-(furan-3-yl)-N-(2-(5-hydroxy-1H-indol-3-yl)-1-(thiazol-4-yl)ethyl)-1H-benzo[d]imidazole-5-carboxamide CHEMBL376487
Type:
Small organic molecule
Emp. Form.:
C31H29N5O3S
Mol. Mass.:
551.659
SMILES:
Oc1ccc2[nH]cc(C[C@H](NC(=O)c3ccc4n(C5CCCCC5)c(nc4c3)-c3ccoc3)c3cscn3)c2c1
: