Target
Amine oxidase [flavin-containing] A
Ligand
BDBM15579
Substrate
Meas. Tech.
ChEMBL_603299 (CHEMBL1049523)
Ki
105660±n/a nM
Citation
 Sahoo, AYabanoglu, SSinha, BNUcar, GBasu, AJayaprakash, V Towards development of selective and reversible pyrazoline based MAO-inhibitors: Synthesis, biological evaluation and docking studies. Bioorg Med Chem Lett 20:132-6 (2010)  
Target
Name:
Amine oxidase [flavin-containing] A
Synonyms:
AOFA_RAT Amine oxidase [flavin-containing] A Monoamine Oxidase Type A (MAO-A) Monoamine oxidase A (MAO-A) Monoamine oxidase type A (MAOA)
Type:
Enzyme
Mol. Mass.:
59515.21
Organism:
Rattus norvegicus (rat)
Description:
Residue:
526
  
Inhibitor
Name:
BDBM15579
Synonyms:
CHEMBL972 L-Deprenyl SLG US8633208, Deprenyl methyl[(2R)-1-phenylpropan-2-yl]prop-2-yn-1-ylamine
Type:
Small organic molecule
Emp. Form.:
C13H17N
Mol. Mass.:
187.2808
SMILES:
C[C@H](Cc1ccccc1)N(C)CC#C
: