Target
Phosphatidylinositol 4,5-bisphosphate 3-kinase catalytic subunit gamma isoform
Ligand
BDBM50305290
Substrate
Meas. Tech.
ChEMBL_603509 (CHEMBL1068428)
IC50
594±n/a nM
Citation
 Venkatesan, AMDehnhardt, CMChen, ZSantos, EDDos Santos, OBursavich, MGilbert, AMEllingboe, JWAyral-Kaloustian, SKhafizova, GBrooijmans, NMallon, RHollander, IFeldberg, LLucas, JYu, KGibbons, JAbraham, RMansour, TS Novel imidazolopyrimidines as dual PI3-Kinase/mTOR inhibitors. Bioorg Med Chem Lett 20:653-6 (2010)  
Target
Name:
Phosphatidylinositol 4,5-bisphosphate 3-kinase catalytic subunit gamma isoform
Synonyms:
PI3-kinase p110 subunit gamma PI3Kgamma PK3CG_HUMAN Phosphatidylinositol 4,5-bisphosphate 3-kinase (PI3K) Phosphatidylinositol 4,5-bisphosphate 3-kinase catalytic subunit gamma (PI3Kgamma) Phosphatidylinositol 4,5-bisphosphate 3-kinase catalytic subunit gamma isoform (PI3K) Phosphatidylinositol-4,5-bisphosphate 3-kinase catalytic subunit gamma isoform Phosphoinositide 3-kinases gamma (PI3K gamma) p120-PI3K
Type:
Enzyme Subunit
Mol. Mass.:
126470.30
Organism:
Homo sapiens (Human)
Description:
P48736
Residue:
1102
  
Inhibitor
Name:
BDBM50305290
Synonyms:
(3-(9-(1-(4-fluorobenzyl)piperidin-4-yl)-6-morpholino-9H-purin-2-yl)phenyl)methanol | CHEMBL591338
Type:
Small organic molecule
Emp. Form.:
C28H31FN6O2
Mol. Mass.:
502.5831
SMILES:
OCc1cccc(c1)-c1nc(N2CCOCC2)c2ncn(C3CCN(Cc4ccc(F)cc4)CC3)c2n1
: