Target
Serine/threonine-protein kinase mTOR
Ligand
BDBM50305291
Substrate
Meas. Tech.
ChEMBL_603510 (CHEMBL1068429)
IC50
720±n/a nM
Citation
 Venkatesan, AMDehnhardt, CMChen, ZSantos, EDDos Santos, OBursavich, MGilbert, AMEllingboe, JWAyral-Kaloustian, SKhafizova, GBrooijmans, NMallon, RHollander, IFeldberg, LLucas, JYu, KGibbons, JAbraham, RMansour, TS Novel imidazolopyrimidines as dual PI3-Kinase/mTOR inhibitors. Bioorg Med Chem Lett 20:653-6 (2010)  
Target
Name:
Serine/threonine-protein kinase mTOR
Synonyms:
FK506-binding protein 12-rapamycin complex-associated protein 1 FRAP FRAP1 MTOR Mammalian Target of Rapamycin (mTOR) RAFT1 Rapamycin and FKBP12 target 1 Serine/threonine-protein kinase (mTOR) | mTORC2
Type:
Rapamycin target protein
Mol. Mass.:
288917.12
Organism:
Homo sapiens (Human)
Description:
P42345
Residue:
2549
  
Inhibitor
Name:
BDBM50305291
Synonyms:
(3-(6-morpholino-9-(1-(4-(pyridin-4-yl)benzyl)piperidin-4-yl)-9H-purin-2-yl)phenyl)methanol | CHEMBL583228
Type:
Small organic molecule
Emp. Form.:
C33H35N7O2
Mol. Mass.:
561.6767
SMILES:
OCc1cccc(c1)-c1nc(N2CCOCC2)c2ncn(C3CCN(Cc4ccc(cc4)-c4ccncc4)CC3)c2n1
: