Target
Phosphatidylinositol 4,5-bisphosphate 3-kinase catalytic subunit alpha isoform
Ligand
BDBM50305304
Substrate
Meas. Tech.
ChEMBL_603508 (CHEMBL1068427)
IC50
37±n/a nM
Citation
 Venkatesan, AMDehnhardt, CMChen, ZSantos, EDDos Santos, OBursavich, MGilbert, AMEllingboe, JWAyral-Kaloustian, SKhafizova, GBrooijmans, NMallon, RHollander, IFeldberg, LLucas, JYu, KGibbons, JAbraham, RMansour, TS Novel imidazolopyrimidines as dual PI3-Kinase/mTOR inhibitors. Bioorg Med Chem Lett 20:653-6 (2010)  
Target
Name:
Phosphatidylinositol 4,5-bisphosphate 3-kinase catalytic subunit alpha isoform
Synonyms:
P42336 PI3-kinase subunit p110-alpha PIK3CA Phosphatidylinositol 3-kinase alpha (PI3Kalpha) Phosphatidylinositol 4,5-bisphosphate 3-kinase (PI3K) Phosphatidylinositol 4,5-bisphosphate 3-kinase catalytic subunit alpha (PI3Kalpha) Phosphatidylinositol 4,5-bisphosphate 3-kinase catalytic subunit alpha isoform (PI3-Ka) Phosphatidylinositol 4,5-bisphosphate 3-kinase catalytic subunit alpha isoform (PI3K p110alpha) Phosphatidylinositol 4,5-bisphosphate 3-kinase catalytic subunit alpha isoform (PI3K-alpha) Phosphatidylinositol 4,5-bisphosphate 3-kinase catalytic subunit alpha isoform (PI3Kalpha p110alpha) Phosphatidylinositol 4,5-bisphosphate 3-kinase catalytic subunit alpha isoform (PIK3CA) Phosphatidylinositol-4,5-bisphosphate 3-kinase catalytic subunit alpha isoform Phosphoinositide 3-Kinase (PI3K), alpha Chain A Phosphoinositide 3-kinases (PI3K) PtdIns-3-kinase p110 | p110 alpha
Type:
Enzyme Subunit
Mol. Mass.:
124294.87
Organism:
Homo sapiens (Human)
Description:
P42336
Residue:
1068
  
Inhibitor
Name:
BDBM50305304
Synonyms:
3-(9-(1-((5-chloropyridin-3-yl)methyl)piperidin-4-yl)-6-morpholino-9H-purin-2-yl)phenol | CHEMBL593064
Type:
Small organic molecule
Emp. Form.:
C26H28ClN7O2
Mol. Mass.:
505.999
SMILES:
Oc1cccc(c1)-c1nc(N2CCOCC2)c2ncn(C3CCN(Cc4cncc(Cl)c4)CC3)c2n1
: