Target
17-beta-hydroxysteroid dehydrogenase type 3
Ligand
BDBM50305308
Substrate
Meas. Tech.
ChEMBL_603517 (CHEMBL1068436)
IC50
100±n/a nM
Citation
 Harada, KKubo, HTomigahara, YNishioka, KTakahashi, JMomose, MInoue, SKojima, A Coumarins as novel 17beta-hydroxysteroid dehydrogenase type 3 inhibitors for potential treatment of prostate cancer. Bioorg Med Chem Lett 20:272-5 (2010)  
Target
Name:
17-beta-hydroxysteroid dehydrogenase type 3
Synonyms:
17-beta-hydroxysteroid dehydrogenase type 3 EDH17B3 HSD17B3 | SDR12C2
Type:
Enzyme
Mol. Mass.:
34525.39
Organism:
Homo sapiens (Human)
Description:
P37058
Residue:
310
  
Inhibitor
Name:
BDBM50305308
Synonyms:
4-ethyl-7-hydroxy-2H-chromen-2-one | CHEMBL600114
Type:
Small organic molecule
Emp. Form.:
C11H10O3
Mol. Mass.:
190.1953
SMILES:
CCc1cc(=O)oc2cc(O)ccc12
: