Target
Cannabinoid receptor 1
Ligand
BDBM50305404
Substrate
Meas. Tech.
ChEMBL_603744 (CHEMBL1039369)
IC50
0.7±n/a nM
Citation
 Cooper, MReceveur, JMBjurling, ENørregaard, PKNielsen, PASköld, NHögberg, T Exploring SAR features in diverse library of 4-cyanomethyl-pyrazole-3-carboxamides suitable for further elaborations as CB1 antagonists. Bioorg Med Chem Lett 20:26-30 (2010)  
Target
Name:
Cannabinoid receptor 1
Synonyms:
CANN6 CB-R CNR CNR1_HUMAN Cannabinoid receptor Cannabinoid receptor 1 (brain)
Type:
G Protein-Coupled Receptor (GPCR)
Mol. Mass.:
52868.96
Organism:
Homo sapiens (Human)
Description:
P21554
Residue:
472
  
Inhibitor
Name:
BDBM50305404
Synonyms:
CHEMBL590387 | N-(3-bromo-4-fluorobenzyl)-1-(2-chlorophenyl)-5-(4-chlorophenyl)-4-(cyanomethyl)-1H-pyrazole-3-carboxamide
Type:
Small organic molecule
Emp. Form.:
C25H16BrCl2FN4O
Mol. Mass.:
558.229
SMILES:
Fc1ccc(CNC(=O)c2nn(c(c2CC#N)-c2ccc(Cl)cc2)-c2ccccc2Cl)cc1Br
: