Target
Oxysterols receptor LXR-alpha
Ligand
BDBM50305497
Substrate
Meas. Tech.
ChEMBL_604018 (CHEMBL1049546)
IC50
445±n/a nM
Citation
 Hu, BBernotas, RUnwalla, RCollini, MQuinet, EFeingold, IGoos-Nilsson, AWilhelmsson, ANambi, PEvans, MWrobel, J Quinoline-3-carboxamide containing sulfones as liver X receptor (LXR) agonists with binding selectivity for LXRbeta and low blood-brain penetration. Bioorg Med Chem Lett 20:689-93 (2010)  
Target
Name:
Oxysterols receptor LXR-alpha
Synonyms:
LXRA Liver X receptor alpha Liver X receptor alpha (NR1H3) NR1H3 Nuclear orphan receptor LXR-alpha | Nuclear receptor subfamily 1 group H member 3
Type:
Enzyme Catalytic Domain
Mol. Mass.:
50403.85
Organism:
Homo sapiens (Human)
Description:
Q13133
Residue:
447
  
Inhibitor
Name:
BDBM50305497
Synonyms:
(4-(3-(3-(methylsulfonyl)phenoxy)phenyl)-8-(trifluoromethyl)quinolin-3-yl)methanamine | CHEMBL590584
Type:
Small organic molecule
Emp. Form.:
C24H19F3N2O3S
Mol. Mass.:
472.479
SMILES:
CS(=O)(=O)c1cccc(Oc2cccc(c2)-c2c(CN)cnc3c(cccc23)C(F)(F)F)c1
: