Target
Beta-secretase 1
Ligand
BDBM50305527
Substrate
Meas. Tech.
ChEMBL_604240 (CHEMBL1050385)
IC50
17±n/a nM
Citation
 Lerchner, AMachauer, RBetschart, CVeenstra, SRueeger, HMcCarthy, CTintelnot-Blomley, MJaton, ALRabe, SDesrayaud, SEnz, AStaufenbiel, MPaganetti, PRondeau, JMNeumann, U Macrocyclic BACE-1 inhibitors acutely reduce Abeta in brain after po application. Bioorg Med Chem Lett 20:603-7 (2010)  
Target
Name:
Beta-secretase 1
Synonyms:
ASP2 Aspartyl protease 2 BACE1 Beta-secretase (BACE) Beta-secretase 1 (BACE 1) Beta-secretase 1 (BACE1) Beta-site amyloid precursor protein cleaving enzyme 1 Memapsin-2 beta-Secretase (BACE-1) | beta-Secretase (BACE1)
Type:
Protein
Mol. Mass.:
55755.10
Organism:
Homo sapiens (Human)
Description:
P56817
Residue:
501
  
Inhibitor
Name:
BDBM50305527
Synonyms:
(4S)-4-[(1R)-1-hydroxy-2-({1-[3-(1-methylethyl)phenyl]cyclopropyl}amino)ethyl]-19-(methoxymethyl)-11-oxa-3,16-diazatricyclo[15.3.1.1~6,10~]docosa-1(21),6(22),7,9,17,19-hexaen-2-one CHEMBL595066
Type:
Small organic molecule
Emp. Form.:
C35H45N3O4
Mol. Mass.:
571.7495
SMILES:
COCc1cc2NCCCCOc3cccc(C[C@H](NC(=O)c(c1)c2)[C@H](O)CNC1(CC1)c1cccc(c1)C(C)C)c3
: