Target
Bifunctional epoxide hydrolase 2
Ligand
BDBM50305642
Substrate
Meas. Tech.
ChEMBL_604539 (CHEMBL1074709)
EC50
0.29±n/a nM
Citation
 Eldrup, ABSoleymanzadeh, FFarrow, NAKukulka, ADe Lombaert, S Optimization of piperidyl-ureas as inhibitors of soluble epoxide hydrolase. Bioorg Med Chem Lett 20:571-5 (2010)  
Target
Name:
Bifunctional epoxide hydrolase 2
Synonyms:
Cytosolic epoxide hydrolase 2 EPHX2 HYES_HUMAN Soluble epoxide hydrolase (sEH) | epoxide hydrolase 2, cytoplasmic
Type:
Enzyme
Mol. Mass.:
62613.07
Organism:
Homo sapiens (Human)
Description:
P34913
Residue:
555
  
Inhibitor
Name:
BDBM50305642
Synonyms:
CHEMBL589138 | N-(2,4-dichlorobenzyl)-4-(4-(N-methylsulfamoyl)phenoxy)piperidine-1-carboxamide
Type:
Small organic molecule
Emp. Form.:
C20H23Cl2N3O4S
Mol. Mass.:
472.385
SMILES:
CNS(=O)(=O)c1ccc(OC2CCN(CC2)C(=O)NCc2ccc(Cl)cc2Cl)cc1
: