Target
Cytochrome P450 2C9
Ligand
BDBM50305628
Substrate
Meas. Tech.
ChEMBL_604541 (CHEMBL1074711)
IC50
1400±n/a nM
Citation
 Eldrup, ABSoleymanzadeh, FFarrow, NAKukulka, ADe Lombaert, S Optimization of piperidyl-ureas as inhibitors of soluble epoxide hydrolase. Bioorg Med Chem Lett 20:571-5 (2010)  
Target
Name:
Cytochrome P450 2C9
Synonyms:
(R)-limonene 6-monooxygenase CP2C9_HUMAN CYP2C9 Cytochrome P450 2C9 (CYP2C9 ) P-450MP P450 PB-1 | S-mephenytoin 4-hydroxylase
Type:
Enzyme
Mol. Mass.:
55636.33
Organism:
Homo sapiens (Human)
Description:
P11712
Residue:
490
  
Inhibitor
Name:
BDBM50305628
Synonyms:
CHEMBL589135 | N-(2,4-dichlorobenzyl)-4-phenoxypiperidine-1-carboxamide
Type:
Small organic molecule
Emp. Form.:
C19H20Cl2N2O2
Mol. Mass.:
379.28
SMILES:
Clc1ccc(CNC(=O)N2CCC(CC2)Oc2ccccc2)c(Cl)c1
: