Target
Cytochrome P450 2J2
Ligand
BDBM50305643
Substrate
Meas. Tech.
ChEMBL_604540 (CHEMBL1074710)
IC50
20000±n/a nM
Citation
 Eldrup, ABSoleymanzadeh, FFarrow, NAKukulka, ADe Lombaert, S Optimization of piperidyl-ureas as inhibitors of soluble epoxide hydrolase. Bioorg Med Chem Lett 20:571-5 (2010)  
Target
Name:
Cytochrome P450 2J2
Synonyms:
CP2J2_HUMAN | CYP2J2
Type:
Enzyme
Mol. Mass.:
57623.04
Organism:
Homo sapiens (Human)
Description:
P51589
Residue:
502
  
Inhibitor
Name:
BDBM50305643
Synonyms:
4-(1-(2,4-dichlorobenzylcarbamoyl)piperidin-4-yloxy)benzoic acid | CHEMBL608263
Type:
Small organic molecule
Emp. Form.:
C20H20Cl2N2O4
Mol. Mass.:
423.29
SMILES:
OC(=O)c1ccc(OC2CCN(CC2)C(=O)NCc2ccc(Cl)cc2Cl)cc1
: