Target
Neutrophil elastase
Ligand
BDBM50305812
Substrate
Meas. Tech.
ChEMBL_605043 (CHEMBL1071303)
IC50
>100000±n/a nM
Citation
 Xu, GHKim, YHChi, SWChoo, SJRyoo, IJAhn, JSYoo, ID Evaluation of human neutrophil elastase inhibitory effect of iridoid glycosides from Hedyotis diffusa. Bioorg Med Chem Lett 20:513-5 (2010)  
Target
Name:
Neutrophil elastase
Synonyms:
Bone marrow serine protease Coagulation factor X ELANE Elastase HLE Leukocyte elastase Medullasin Neutrophil elastase (HNE) PMN elastase Trypsin
Type:
Enzyme
Mol. Mass.:
28532.38
Organism:
Homo sapiens (Human)
Description:
P08246
Residue:
267
  
Inhibitor
Name:
BDBM50305812
Synonyms:
6-O-E-pcoumaroyl scandoside methyl ester E-6-O-p-coumaroyl scandoside methyl ester
Type:
Small organic molecule
Emp. Form.:
C26H30O13
Mol. Mass.:
550.5086
SMILES:
COC(=O)C1=CO[C@@H](O[C@@H]2O[C@H](CO)[C@@H](O)[C@H](O)[C@H]2O)[C@H]2[C@@H]1[C@H](OC(=O)\C=C\c1ccc(O)cc1)C=C2CO
: