Target
Voltage-dependent calcium channel alpha-2 delta subunit
Ligand
BDBM50305891
Substrate
Meas. Tech.
ChEMBL_605315 (CHEMBL1071340)
IC50
>10000±n/a nM
Citation
 Blakemore, DCBryans, JSCarnell, PCarr, CLChessum, NEField, MJKinsella, NOsborne, SAWarren, ANWilliams, SC Synthesis and in vivo evaluation of bicyclic gababutins. Bioorg Med Chem Lett 20:461-4 (2010)  
Target
Name:
Voltage-dependent calcium channel alpha-2 delta subunit
Synonyms:
Voltage-dependent calcium channel alpha2delta subunit
Type:
PROTEIN
Mol. Mass.:
123127.66
Organism:
Sus scrofa
Description:
ChEMBL_605546
Residue:
1091
  
Inhibitor
Name:
BDBM50305891
Synonyms:
2-((2S,3aR)-2-(aminomethyl)octahydropentalen-2-yl)acetic acid | CHEMBL594898
Type:
Small organic molecule
Emp. Form.:
C11H19NO2
Mol. Mass.:
197.2741
SMILES:
NC[C@]1(CC(O)=O)C[C@@H]2CCC[C@@H]2C1
: