Target
Oxysterols receptor LXR-beta
Ligand
BDBM50306075
Substrate
Meas. Tech.
ChEMBL_605983 (CHEMBL1069927)
IC50
26±n/a nM
Citation
 Travins, JMBernotas, RCKaufman, DHQuinet, ENambi, PFeingold, IHuselton, CWilhelmsson, AGoos-Nilsson, AWrobel, J 1-(3-Aryloxyaryl)benzimidazole sulfones are liver X receptor agonists. Bioorg Med Chem Lett 20:526-30 (2010)  
Target
Name:
Oxysterols receptor LXR-beta
Synonyms:
LXRB Liver X, LXR beta NR1H2 Nuclear receptor NER Ubiquitously-expressed nuclear receptor
Type:
Enzyme Catalytic Domain
Mol. Mass.:
50978.79
Organism:
Homo sapiens (Human)
Description:
P55055
Residue:
460
  
Inhibitor
Name:
BDBM50306075
Synonyms:
4-chloro-2-isopropyl-1-(3-(3-(methylsulfonyl)phenoxy)phenyl)-1H-benzo[d]imidazole | CHEMBL594063
Type:
Small organic molecule
Emp. Form.:
C23H21ClN2O3S
Mol. Mass.:
440.942
SMILES:
CC(C)c1nc2c(Cl)cccc2n1-c1cccc(Oc2cccc(c2)S(C)(=O)=O)c1
: