Target
Oxysterols receptor LXR-beta
Ligand
BDBM50306062
Substrate
Meas. Tech.
ChEMBL_605983 (CHEMBL1069927)
IC50
462±n/a nM
Citation
 Travins, JMBernotas, RCKaufman, DHQuinet, ENambi, PFeingold, IHuselton, CWilhelmsson, AGoos-Nilsson, AWrobel, J 1-(3-Aryloxyaryl)benzimidazole sulfones are liver X receptor agonists. Bioorg Med Chem Lett 20:526-30 (2010)  
Target
Name:
Oxysterols receptor LXR-beta
Synonyms:
LXRB Liver X, LXR beta NR1H2 Nuclear receptor NER Ubiquitously-expressed nuclear receptor
Type:
Enzyme Catalytic Domain
Mol. Mass.:
50978.79
Organism:
Homo sapiens (Human)
Description:
P55055
Residue:
460
  
Inhibitor
Name:
BDBM50306062
Synonyms:
2-methyl-1-(3-(3-(propylsulfonyl)phenoxy)phenyl)-4-(trifluoromethyl)-1H-benzo[d]imidazole | CHEMBL604907
Type:
Small organic molecule
Emp. Form.:
C24H21F3N2O3S
Mol. Mass.:
474.495
SMILES:
CCCS(=O)(=O)c1cccc(Oc2cccc(c2)-n2c(C)nc3c(cccc23)C(F)(F)F)c1
: