Target
Oxysterols receptor LXR-alpha
Ligand
BDBM50306061
Substrate
Meas. Tech.
ChEMBL_605982 (CHEMBL1069926)
IC50
5.6±n/a nM
Citation
 Travins, JMBernotas, RCKaufman, DHQuinet, ENambi, PFeingold, IHuselton, CWilhelmsson, AGoos-Nilsson, AWrobel, J 1-(3-Aryloxyaryl)benzimidazole sulfones are liver X receptor agonists. Bioorg Med Chem Lett 20:526-30 (2010)  
Target
Name:
Oxysterols receptor LXR-alpha
Synonyms:
LXRA Liver X receptor alpha Liver X receptor alpha (NR1H3) NR1H3 Nuclear orphan receptor LXR-alpha | Nuclear receptor subfamily 1 group H member 3
Type:
Enzyme Catalytic Domain
Mol. Mass.:
50403.85
Organism:
Homo sapiens (Human)
Description:
Q13133
Residue:
447
  
Inhibitor
Name:
BDBM50306061
Synonyms:
4-chloro-1-(3-(3-(isopropylsulfonyl)phenoxy)phenyl)-2-methyl-1H-benzo[d]imidazole | CHEMBL596591
Type:
Small organic molecule
Emp. Form.:
C23H21ClN2O3S
Mol. Mass.:
440.942
SMILES:
CC(C)S(=O)(=O)c1cccc(Oc2cccc(c2)-n2c(C)nc3c(Cl)cccc23)c1
: