Target
Oxysterols receptor LXR-alpha
Ligand
BDBM50306077
Substrate
Meas. Tech.
ChEMBL_605982 (CHEMBL1069926)
IC50
2.4±n/a nM
Citation
 Travins, JMBernotas, RCKaufman, DHQuinet, ENambi, PFeingold, IHuselton, CWilhelmsson, AGoos-Nilsson, AWrobel, J 1-(3-Aryloxyaryl)benzimidazole sulfones are liver X receptor agonists. Bioorg Med Chem Lett 20:526-30 (2010)  
Target
Name:
Oxysterols receptor LXR-alpha
Synonyms:
LXRA Liver X receptor alpha Liver X receptor alpha (NR1H3) NR1H3 Nuclear orphan receptor LXR-alpha | Nuclear receptor subfamily 1 group H member 3
Type:
Enzyme Catalytic Domain
Mol. Mass.:
50403.85
Organism:
Homo sapiens (Human)
Description:
Q13133
Residue:
447
  
Inhibitor
Name:
BDBM50306077
Synonyms:
1-(2-chloro-5-(3-(ethylsulfonyl)phenoxy)phenyl)-4-(trifluoromethyl)-1H-benzo[d]imidazole | CHEMBL594367
Type:
Small organic molecule
Emp. Form.:
C22H16ClF3N2O3S
Mol. Mass.:
480.887
SMILES:
CCS(=O)(=O)c1cccc(Oc2ccc(Cl)c(c2)-n2cnc3c(cccc23)C(F)(F)F)c1
: