Target
Coagulation factor X
Ligand
BDBM50306138
Substrate
Meas. Tech.
ChEMBL_606078 (CHEMBL1071977)
Ki
0.8±n/a nM
Citation
 Kleanthous, SBorthwick, ADBrown, DBurns-Kurtis, CLCampbell, MChaudry, LChan, CClarte, MOConvery, MAHarling, JDHortense, EIrving, WRIrvine, SPateman, AJPatikis, ANPinto, ILPollard, DRRoethka, TJSenger, SShah, GPStelman, GJToomey, JRWatson, NSWest, RIWhittaker, CZhou, PYoung, RJ Structure and property based design of factor Xa inhibitors: pyrrolidin-2-ones with monoaryl P4 motifs. Bioorg Med Chem Lett 20:618-22 (2010)  
Target
Name:
Coagulation factor X
Synonyms:
Activated coagulation factor X (FXa) Coagulation factor X precursor F10 Factor X heavy chain Factor Xa Stuart-Prower factor
Type:
Enzyme
Mol. Mass.:
54726.60
Organism:
Homo sapiens (Human)
Description:
Residue:
488
  
Inhibitor
Name:
BDBM50306138
Synonyms:
CHEMBL604887 | N-((3S)-1-(4-(1-(azetidin-1-yl)ethyl)-2-fluorophenyl)-2-oxopyrrolidin-3-yl)-6-chloronaphthalene-2-sulfonamide
Type:
Small organic molecule
Emp. Form.:
C25H25ClFN3O3S
Mol. Mass.:
502.001
SMILES:
CC(N1CCC1)c1ccc(N2CC[C@H](NS(=O)(=O)c3ccc4cc(Cl)ccc4c3)C2=O)c(F)c1
: