Target
Delta-type opioid receptor
Ligand
BDBM50306288
Substrate
Meas. Tech.
ChEMBL_607037 (CHEMBL1074665)
Ki
0.800000±n/a nM
Citation
 Liras, SMcHardy, SFAllen, MPSegelstein, BEHeck, SDBryce, DKSchmidt, AWVanase-Frawley, MCallegari, EMcLean, S Biaryl piperidines as potent and selective delta opioid receptor ligands. Bioorg Med Chem Lett 20:503-7 (2010)  
Target
Name:
Delta-type opioid receptor
Synonyms:
D-OR-1 Delta opioid receptor OPIATE Delta OPRD1 OPRK1 | opioid receptor, delta 1
Type:
G Protein-Coupled Receptor (GPCR)
Mol. Mass.:
40382.98
Organism:
Homo sapiens (Human)
Description:
Competition binding assays were carried out using membrane preparations from transfected HN9.10 cells that constitutively expressed the delta opioid receptor.
Residue:
372
  
Inhibitor
Name:
BDBM50306288
Synonyms:
4-(1-(cyclopropylmethyl)-3-(3-hydroxyphenyl)piperidin-3-yl)-N,N-diethylbenzamide | CHEMBL605293
Type:
Small organic molecule
Emp. Form.:
C26H34N2O2
Mol. Mass.:
406.5604
SMILES:
CCN(CC)C(=O)c1ccc(cc1)C1(CCCN(CC2CC2)C1)c1cccc(O)c1
: