Target
D(2) dopamine receptor
Ligand
BDBM50306319
Substrate
Meas. Tech.
ChEMBL_609556 (CHEMBL1073809)
Ki
552±n/a nM
Citation
 Qiang, LSasikumar, TKBurnett, DASu, JTang, HYe, YMazzola, RDZhu, ZMcKittrick, BAGreenlee, WJFawzi, ASmith, MZhang, HLachowicz, JE Discovery of new SCH 39166 analogs as potent and selective dopamine D1 receptor antagonists. Bioorg Med Chem Lett 20:836-40 (2010)  
Target
Name:
D(2) dopamine receptor
Synonyms:
D(2) dopamine receptor DOPAMINE D2 Long DRD2 Dopamine D2 receptor Dopamine D2 receptor (D2R) Dopamine2-like | d2
Type:
Cell-surface receptors
Mol. Mass.:
50647.10
Organism:
Homo sapiens (Human)
Description:
P14416
Residue:
443
  
Inhibitor
Name:
BDBM50306319
Synonyms:
(R)-5-(4-((benzyl(2,4-difluorophenyl)amino)methyl)phenyl)-8-chloro-3-methyl-2,3,4,5-tetrahydro-1H-benzo[d]azepin-7-ol | CHEMBL597702
Type:
Small organic molecule
Emp. Form.:
C31H29ClF2N2O
Mol. Mass.:
519.025
SMILES:
CN1CCc2cc(Cl)c(O)cc2[C@H](C1)c1ccc(CN(Cc2ccccc2)c2ccc(F)cc2F)cc1
: