Target
D(2) dopamine receptor
Ligand
BDBM50004823
Substrate
Meas. Tech.
ChEMBL_609556 (CHEMBL1073809)
Ki
980±n/a nM
Citation
 Qiang, LSasikumar, TKBurnett, DASu, JTang, HYe, YMazzola, RDZhu, ZMcKittrick, BAGreenlee, WJFawzi, ASmith, MZhang, HLachowicz, JE Discovery of new SCH 39166 analogs as potent and selective dopamine D1 receptor antagonists. Bioorg Med Chem Lett 20:836-40 (2010)  
Target
Name:
D(2) dopamine receptor
Synonyms:
D(2) dopamine receptor DOPAMINE D2 Long DRD2 Dopamine D2 receptor Dopamine D2 receptor (D2R) Dopamine2-like | d2
Type:
Cell-surface receptors
Mol. Mass.:
50647.10
Organism:
Homo sapiens (Human)
Description:
P14416
Residue:
443
  
Inhibitor
Name:
BDBM50004823
Synonyms:
(6aS,13bR)-11-Chloro-7-methyl-5,6a,7,8,9,13b-hexahydro-6H-7-aza-benzo[6,7]cyclohepta[1,2-a]naphthalen-12-ol 11-Chloro-7-methyl-5,6a,7,8,9,13b-hexahydro-6H-7-aza-benzo[6,7]cyclohepta[1,2-a]naphthalen-12-ol Ecopipam trans-(-) 11-Chloro-7-methyl-5,6a,7,8,9,13b-hexahydro-6H-7-aza-benzo[6,7]cyclohepta[1,2-a]naphthalen-12-ol
Type:
Small organic molecule
Emp. Form.:
C19H20ClNO
Mol. Mass.:
313.821
SMILES:
CN1CCc2cc(Cl)c(O)cc2[C@@H]2[C@@H]1CCc1ccccc21
: