Target
D(2) dopamine receptor
Ligand
BDBM50306326
Substrate
Meas. Tech.
ChEMBL_609556 (CHEMBL1073809)
Ki
3900±n/a nM
Citation
 Qiang, LSasikumar, TKBurnett, DASu, JTang, HYe, YMazzola, RDZhu, ZMcKittrick, BAGreenlee, WJFawzi, ASmith, MZhang, HLachowicz, JE Discovery of new SCH 39166 analogs as potent and selective dopamine D1 receptor antagonists. Bioorg Med Chem Lett 20:836-40 (2010)  
Target
Name:
D(2) dopamine receptor
Synonyms:
D(2) dopamine receptor DOPAMINE D2 Long DRD2 Dopamine D2 receptor Dopamine D2 receptor (D2R) Dopamine2-like | d2
Type:
Cell-surface receptors
Mol. Mass.:
50647.10
Organism:
Homo sapiens (Human)
Description:
P14416
Residue:
443
  
Inhibitor
Name:
BDBM50306326
Synonyms:
CHEMBL603485 | ethyl(6aS,13bR)-11-chloro-12-hydroxy-7-methyl-6,6a,7,8,9,13b-hexahydro-5H-benzo[d]naphtho[2,1-b]azepin-3-ylcarbamate
Type:
Small organic molecule
Emp. Form.:
C22H25ClN2O3
Mol. Mass.:
400.899
SMILES:
CCOC(=O)Nc1ccc2[C@H]3[C@H](CCc2c1)N(C)CCc1cc(Cl)c(O)cc31
: