Target
Cholinesterase
Ligand
BDBM50306339
Substrate
Meas. Tech.
ChEMBL_609577 (CHEMBL1073830)
Ki
3180±n/a nM
Citation
 Vitorovic-Todorovic, MDJuranic, IOMandic, LMDrakulic, BJ 4-Aryl-4-oxo-N-phenyl-2-aminylbutyramides as acetyl- and butyrylcholinesterase inhibitors. Preparation, anticholinesterase activity, docking study, and 3D structure-activity relationship based on molecular interaction fields. Bioorg Med Chem 18:1181-93 (2010)  
Target
Name:
Cholinesterase
Synonyms:
BCHE CHLE_HORSE | Cholinesterase
Type:
Enzyme
Mol. Mass.:
65643.35
Organism:
Equus caballus (Horse)
Description:
P81908
Residue:
574
  
Inhibitor
Name:
BDBM50306339
Synonyms:
4-(2,4-Diisopropylphenyl)-4-oxo-N-phenyl-2-(R,S)-(4-morpholinyl)butyramide | CHEMBL599529
Type:
Small organic molecule
Emp. Form.:
C26H34N2O3
Mol. Mass.:
422.5598
SMILES:
CC(C)c1ccc(C(=O)CC(N2CCOCC2)C(=O)Nc2ccccc2)c(c1)C(C)C
: