Target
Free fatty acid receptor 1
Ligand
BDBM50306406
Substrate
Meas. Tech.
ChEMBL_609846 (CHEMBL1072787)
EC50
124±n/a nM
Citation
 Zhou, CTang, CChang, EGe, MLin, SCline, ETan, CPFeng, YZhou, YPEiermann, GJPetrov, ASalituro, GMeinke, PMosley, RAkiyama, TEEinstein, MKumar, SBerger, JHoward, ADThornberry, NMills, SGYang, L Discovery of 5-aryloxy-2,4-thiazolidinediones as potent GPR40 agonists. Bioorg Med Chem Lett 20:1298-301 (2010)  
Target
Name:
Free fatty acid receptor 1
Synonyms:
FFAR1 G-protein Coupled Receptor 40 | GPR40
Type:
G Protein-Coupled Receptor (GPCR)
Mol. Mass.:
31473.32
Organism:
Homo sapiens (Human)
Description:
O14842
Residue:
300
  
Inhibitor
Name:
BDBM50306406
Synonyms:
5-(4-(o-tolyloxy)benzyl)thiazolidine-2,4-dione | CHEMBL597436
Type:
Small organic molecule
Emp. Form.:
C17H15NO3S
Mol. Mass.:
313.371
SMILES:
Cc1ccccc1Oc1ccc(Cc2sc(=O)[nH]c2O)cc1
: