Target
11-beta-hydroxysteroid dehydrogenase type 2
Ligand
BDBM50306426
Substrate
Meas. Tech.
ChEMBL_609883 (CHEMBL1073439)
IC50
>10000±n/a nM
Citation
 Tice, CMZhao, WXu, ZCacatian, STSimpson, RDYe, YJSingh, SBMcKeever, BMLindblom, PGuo, JKrosky, PMKruk, BABerbaum, JHarrison, RKJohnson, JJBukhtiyarov, YPanemangalore, RScott, BBZhao, YBruno, JGZhuang, LMcGeehan, GMHe, WClaremon, DA Spirocyclic ureas: orally bioavailable 11beta-HSD1 inhibitors identified by computer-aided drug design. Bioorg Med Chem Lett 20:881-6 (2010)  
Target
Name:
11-beta-hydroxysteroid dehydrogenase type 2
Synonyms:
11-DH2 11-beta-Hydroxysteroid Dehydrogenase 2 (11-beta-HSD2) 11-beta-hydroxysteroid dehydrogenase 2 11-beta-hydroxysteroid dehydrogenase type 2 (11-beta-HSD2) DHI2_HUMAN HSD11K SDR9C3
Type:
Enzyme
Mol. Mass.:
44141.72
Organism:
Homo sapiens (Human)
Description:
Purified recombinant human 11beta-HSD2.
Residue:
405
  
Inhibitor
Name:
BDBM50306426
Synonyms:
2-{1'-[(adamantan-2-yl)carbamoyl]-5-chloro-2,3-dihydrospiro[indene-1,4'-piperidine]-3-yl}acetic acid | CHEMBL605954
Type:
Small organic molecule
Emp. Form.:
C26H33ClN2O3
Mol. Mass.:
457.005
SMILES:
OC(=O)CC1CC2(CCN(CC2)C(=O)NC2C3CC4CC(C3)CC2C4)c2ccc(Cl)cc12
: