Target
D(1A) dopamine receptor
Ligand
BDBM50306447
Substrate
Meas. Tech.
ChEMBL_609907 (CHEMBL1074769)
Ki
0.9±n/a nM
Citation
 Sasikumar, TKBurnett, DAGreenlee, WJSmith, MFawzi, AZhang, HLachowicz, JE Remote functionalization of SCH 39166: discovery of potent and selective benzazepine dopamine D1 receptor antagonists. Bioorg Med Chem Lett 20:832-5 (2010)  
Target
Name:
D(1A) dopamine receptor
Synonyms:
DA D1 receptor DRD1 Dopamine D1 receptor Dopamine D1A
Type:
Enzyme
Mol. Mass.:
49303.43
Organism:
Homo sapiens (Human)
Description:
P21728
Residue:
446
  
Inhibitor
Name:
BDBM50306447
Synonyms:
(6aS,13bS)-11-chloro-4-(3,5-difluorophenyl)-7-methyl-6,6a,7,8,9,13b-hexahydro-5H-benzo[d]naphtho[2,1-b]azepin-12-ol | CHEMBL597100
Type:
Small organic molecule
Emp. Form.:
C25H22ClF2NO
Mol. Mass.:
425.898
SMILES:
CN1CCc2cc(Cl)c(O)cc2[C@@H]2[C@@H]1CCc1c2cccc1-c1cc(F)cc(F)c1
: