Target
D(1B) dopamine receptor
Ligand
BDBM50306441
Substrate
Meas. Tech.
ChEMBL_609908 (CHEMBL1074770)
Ki
2.1±n/a nM
Citation
 Sasikumar, TKBurnett, DAGreenlee, WJSmith, MFawzi, AZhang, HLachowicz, JE Remote functionalization of SCH 39166: discovery of potent and selective benzazepine dopamine D1 receptor antagonists. Bioorg Med Chem Lett 20:832-5 (2010)  
Target
Name:
D(1B) dopamine receptor
Synonyms:
D(5) dopamine receptor DOPAMINE D5 DRD1L2 DRD5_HUMAN | dopamine receptor D5
Type:
Protein
Mol. Mass.:
52943.41
Organism:
Homo sapiens (Human)
Description:
P21918
Residue:
477
  
Inhibitor
Name:
BDBM50306441
Synonyms:
11-chloro-12-hydroxy-7-methyl-6,6a,7,8,9,13b-hexahydro-5H-benzo[d]naphtho[2,1-b]azepine-4-carbaldehyde O-phenyl oxime | CHEMBL605354
Type:
Small organic molecule
Emp. Form.:
C26H25ClN2O2
Mol. Mass.:
432.942
SMILES:
CN1CCc2cc(Cl)c(O)cc2[C@@H]2[C@@H]1CCc1c(\C=N\Oc3ccccc3)cccc21
: