Target
Peroxisome proliferator-activated receptor gamma
Ligand
BDBM50306512
Substrate
Meas. Tech.
ChEMBL_610589 (CHEMBL1068981)
IC50
574±n/a nM
Citation
 Lamotte, YMartres, PFaucher, NLaroze, AGrillot, DAncellin, NSaintillan, YBeneton, VGampe, RT Synthesis and biological activities of novel indole derivatives as potent and selective PPARgamma modulators. Bioorg Med Chem Lett 20:1399-404 (2010)  
Target
Name:
Peroxisome proliferator-activated receptor gamma
Synonyms:
NR1C3 PPAR-gamma PPARG_HUMAN Peroxisome proliferator-activated receptor gamma (PPAR gamma) Peroxisome proliferator-activated receptor gamma (PPARĪ³) peroxisome proliferator-activated receptor gamma isoform 2
Type:
Nuclear Receptor
Mol. Mass.:
57613.46
Organism:
Homo sapiens (Human)
Description:
P37231
Residue:
505
  
Inhibitor
Name:
BDBM50306512
Synonyms:
4'-((2,3-dimethyl-5-(2-phenylbutanamido)-1H-indol-1-yl)methyl)biphenyl-2-carboxylic acid | CHEMBL601861
Type:
Small organic molecule
Emp. Form.:
C34H32N2O3
Mol. Mass.:
516.6295
SMILES:
CCC(C(=O)Nc1ccc2n(Cc3ccc(cc3)-c3ccccc3C(O)=O)c(C)c(C)c2c1)c1ccccc1
: