Target
Peroxisome proliferator-activated receptor gamma
Ligand
BDBM50306509
Substrate
Meas. Tech.
ChEMBL_610589 (CHEMBL1068981)
IC50
36±n/a nM
Citation
 Lamotte, YMartres, PFaucher, NLaroze, AGrillot, DAncellin, NSaintillan, YBeneton, VGampe, RT Synthesis and biological activities of novel indole derivatives as potent and selective PPARgamma modulators. Bioorg Med Chem Lett 20:1399-404 (2010)  
Target
Name:
Peroxisome proliferator-activated receptor gamma
Synonyms:
NR1C3 PPAR-gamma PPARG_HUMAN Peroxisome proliferator-activated receptor gamma (PPAR gamma) Peroxisome proliferator-activated receptor gamma (PPARĪ³) peroxisome proliferator-activated receptor gamma isoform 2
Type:
Nuclear Receptor
Mol. Mass.:
57613.46
Organism:
Homo sapiens (Human)
Description:
P37231
Residue:
505
  
Inhibitor
Name:
BDBM50306509
Synonyms:
4'-((3-(methylthio)-5-(2-phenylbutanamido)-2-propyl-1H-indol-1-yl)methyl)biphenyl-2-carboxylic acid | CHEMBL590983
Type:
Small organic molecule
Emp. Form.:
C36H36N2O3S
Mol. Mass.:
576.748
SMILES:
CCCc1c(SC)c2cc(NC(=O)C(CC)c3ccccc3)ccc2n1Cc1ccc(cc1)-c1ccccc1C(O)=O
: