Target
Glycogen phosphorylase, muscle form
Ligand
BDBM50306554
Substrate
Meas. Tech.
ChEMBL_610889 (CHEMBL1065044)
IC50
600000±n/a nM
Citation
 Bokor, EDocsa, TGergely, PSomsák, L Synthesis of 1-(D-glucopyranosyl)-1,2,3-triazoles and their evaluation as glycogen phosphorylase inhibitors. Bioorg Med Chem 18:1171-80 (2010)  
Target
Name:
Glycogen phosphorylase, muscle form
Synonyms:
Glycogen Phosphorylase (PYGM) Glycogen phosphorylase, muscle form PYGM | PYGM_RABIT
Type:
Enzyme
Mol. Mass.:
97296.32
Organism:
Oryctolagus cuniculus (rabbit)
Description:
Phosphorylation of Ser-15 converts phosphorylase B (unphosphorylated) to phosphorylase A.
Residue:
843
  
Inhibitor
Name:
BDBM50306554
Synonyms:
1-(beta-D-Glucopyranosyl)-4-benzyl-1,2,3-triazole | CHEMBL600203
Type:
Small organic molecule
Emp. Form.:
C15H19N3O5
Mol. Mass.:
321.3285
SMILES:
OC[C@H]1O[C@H]([C@H](O)[C@@H](O)[C@@H]1O)n1cc(Cc2ccccc2)nn1
: