Target
Procathepsin L
Ligand
BDBM50306641
Substrate
Meas. Tech.
ChEMBL_611257 (CHEMBL1068286)
IC50
30.5±n/a nM
Citation
 Kishore Kumar, GDChavarria, GECharlton-Sevcik, AKArispe, WMMacdonough, MTStrecker, TEChen, SESiim, BGChaplin, DJTrawick, MLPinney, KG Design, synthesis, and biological evaluation of potent thiosemicarbazone based cathepsin L inhibitors. Bioorg Med Chem Lett 20:1415-9 (2010)  
Target
Name:
Procathepsin L
Synonyms:
CATL1_HUMAN CTSL CTSL1 Cathepsin L Cathepsin L1 heavy chain MEP cathepsin L preproprotein
Type:
Enzyme
Mol. Mass.:
37557.19
Organism:
Homo sapiens (Human)
Description:
Purchased from Calbiochem (San Diego, CA).
Residue:
333
  
Inhibitor
Name:
BDBM50306641
Synonyms:
CHEMBL589280 | [(3-Bromophenyl)-(2-fluorophenyl)-ketone]thiosemicarbazone
Type:
Small organic molecule
Emp. Form.:
C14H11BrFN3S
Mol. Mass.:
352.225
SMILES:
NC(=S)NN=C(c1cccc(Br)c1)c1ccccc1F
: