Target
Hepatocyte growth factor receptor
Ligand
BDBM50306681
Substrate
Meas. Tech.
ChEMBL_611549 (CHEMBL1066393)
IC50
453±n/a nM
Citation
 Nishii, HChiba, TMorikami, KFukami, TASakamoto, HKo, KKoyano, H Discovery of 6-benzyloxyquinolines as c-Met selective kinase inhibitors. Bioorg Med Chem Lett 20:1405-9 (2010)  
Target
Name:
Hepatocyte growth factor receptor
Synonyms:
Hepatocyte growth factor receptor Hepatocyte growth factor receptor (c-MET) MET Met proto-oncogene (hepatocyte growth factor receptor) Tyrosine-protein kinase Met (c-Met) c-Met kinase
Type:
Protein
Mol. Mass.:
155559.73
Organism:
Homo sapiens (Human)
Description:
P08581
Residue:
1390
  
Inhibitor
Name:
BDBM50306681
Synonyms:
(S)-6-(1-(2,6-dichloro-3-fluorophenyl)ethoxy)quinoline | CHEMBL598523
Type:
Small organic molecule
Emp. Form.:
C17H12Cl2FNO
Mol. Mass.:
336.188
SMILES:
C[C@H](Oc1ccc2ncccc2c1)c1c(Cl)ccc(F)c1Cl
: