Target
Bile acid receptor
Ligand
BDBM50306718
Substrate
Meas. Tech.
ChEMBL_611889 (CHEMBL1070844)
EC50
190±n/a nM
Citation
 Lundquist, JTHarnish, DCKim, CYMehlmann, JFUnwalla, RJPhipps, KMCrawley, MLCommons, TGreen, DMXu, WHum, WTEta, JEFeingold, IPatel, VEvans, MJLai, KBorges-Marcucci, LMahaney, PEWrobel, JE Improvement of physiochemical properties of the tetrahydroazepinoindole series of farnesoid X receptor (FXR) agonists: beneficial modulation of lipids in primates. J Med Chem 53:1774-87 (2010)  
Target
Name:
Bile acid receptor
Synonyms:
Bar Farnesol receptor HRR-1 NR1H4_MOUSE Nuclear receptor subfamily 1 group H member 4 Retinoid X receptor-interacting protein 14 | Rip14
Type:
PROTEIN
Mol. Mass.:
55996.68
Organism:
Mus musculus
Description:
ChEMBL_793021
Residue:
488
  
Inhibitor
Name:
BDBM50306718
Synonyms:
CHEMBL602894 | Isopropyl 1,1-Dimethyl-3-[4-(2-morpholin-4-ylethoxy)benzoyl]-1,2,3,6-tetrahydroazepino[4,5-b]indole-5-carboxylate
Type:
Small organic molecule
Emp. Form.:
C31H37N3O5
Mol. Mass.:
531.6426
SMILES:
CC(C)OC(=O)C1=CN(CC(C)(C)c2c1[nH]c1ccccc21)C(=O)c1ccc(OCCN2CCOCC2)cc1
: