Target
Adenosine receptor A2a
Ligand
BDBM50306775
Substrate
Meas. Tech.
ChEMBL_611932 (CHEMBL1071493)
Ki
120000±n/a nM
Citation
 Katritch, VJaakola, VPLane, JRLin, JIjzerman, APYeager, MKufareva, IStevens, RCAbagyan, R Structure-based discovery of novel chemotypes for adenosine A(2A) receptor antagonists. J Med Chem 53:1799-809 (2010)  
Target
Name:
Adenosine receptor A2a
Synonyms:
A2A adenosine receptor (hA2A) ADENOSINE A2 ADORA2 Adenosine A2A receptor (A2AAR)
Type:
G Protein-Coupled Receptor (GPCR)
Mol. Mass.:
44716.46
Organism:
Homo sapiens (Human)
Description:
P29274
Residue:
412
  
Inhibitor
Name:
BDBM50306775
Synonyms:
1,4-diamino-N-butyl-9,10-dioxo-9,10-dihydroanthracene-2-carboxamide | CHEMBL601628
Type:
Small organic molecule
Emp. Form.:
C19H19N3O3
Mol. Mass.:
337.3725
SMILES:
CCCCNC(=O)c1cc(N)c2C(=O)c3ccccc3C(=O)c2c1N
: