Target
5-hydroxytryptamine receptor 2C
Ligand
BDBM50306821
Substrate
Meas. Tech.
ChEMBL_608658 (CHEMBL1067144)
IC50
4755±n/a nM
Citation
 Yoo, EYoon, JPae, ANRhim, HPark, WKKong, JYPark Choo, HY Synthesis and biological evaluation of (phenylpiperazinyl-propyl)arylsulfonamides as selective 5-HT(2A) receptor antagonists. Bioorg Med Chem 18:1665-75 (2010)  
Target
Name:
5-hydroxytryptamine receptor 2C
Synonyms:
5-HT-2C 5-HT2C-INI 5-HTR2C 5-hydroxytryptamine receptor 2C (5-HT-2C) 5HT-1C HTR1C Serotonin (5-HT3) receptor Serotonin Receptor 2C
Type:
G Protein-Coupled Receptor (GPCR)
Mol. Mass.:
51836.79
Organism:
Homo sapiens (Human)
Description:
P28335
Residue:
458
  
Inhibitor
Name:
BDBM50306821
Synonyms:
CHEMBL602889 | N-(Cyclopropylmethyl)-N-(3-(4-(4-fluorophenyl)piperazin-1-yl)propyl)quinoline-8-sulfonamid
Type:
Small organic molecule
Emp. Form.:
C26H31FN4O2S
Mol. Mass.:
482.613
SMILES:
Fc1ccc(cc1)N1CCN(CCCN(CC2CC2)S(=O)(=O)c2cccc3cccnc23)CC1
: