Target
5-hydroxytryptamine receptor 7
Ligand
BDBM50306836
Substrate
Meas. Tech.
ChEMBL_608659 (CHEMBL1067145)
IC50
888±n/a nM
Citation
 Yoo, EYoon, JPae, ANRhim, HPark, WKKong, JYPark Choo, HY Synthesis and biological evaluation of (phenylpiperazinyl-propyl)arylsulfonamides as selective 5-HT(2A) receptor antagonists. Bioorg Med Chem 18:1665-75 (2010)  
Target
Name:
5-hydroxytryptamine receptor 7
Synonyms:
5-HT-7 5-HT7 5-HT7S 5HT7 HTR7 | Serotonin receptor 7
Type:
G Protein-Coupled Receptor (GPCR)
Mol. Mass.:
53573.08
Organism:
Homo sapiens (Human)
Description:
P34969
Residue:
479
  
Inhibitor
Name:
BDBM50306836
Synonyms:
CHEMBL602087 | N-(Cyclohexylmethyl)-N-(3-(4-(3-(trifluoromethyl)phenyl)piperazin-1-yl)propyl)naphthalene-2-sulfonamide
Type:
Small organic molecule
Emp. Form.:
C31H38F3N3O2S
Mol. Mass.:
573.713
SMILES:
FC(F)(F)c1cccc(c1)N1CCN(CCCN(CC2CCCCC2)S(=O)(=O)c2ccc3ccccc3c2)CC1
: