Target
5-hydroxytryptamine receptor 7
Ligand
BDBM50306818
Substrate
Meas. Tech.
ChEMBL_608659 (CHEMBL1067145)
IC50
749±n/a nM
Citation
 Yoo, EYoon, JPae, ANRhim, HPark, WKKong, JYPark Choo, HY Synthesis and biological evaluation of (phenylpiperazinyl-propyl)arylsulfonamides as selective 5-HT(2A) receptor antagonists. Bioorg Med Chem 18:1665-75 (2010)  
Target
Name:
5-hydroxytryptamine receptor 7
Synonyms:
5-HT-7 5-HT7 5-HT7S 5HT7 HTR7 | Serotonin receptor 7
Type:
G Protein-Coupled Receptor (GPCR)
Mol. Mass.:
53573.08
Organism:
Homo sapiens (Human)
Description:
P34969
Residue:
479
  
Inhibitor
Name:
BDBM50306818
Synonyms:
CHEMBL600607 | N-(Cyclopropylmethyl)-N-(3-(4-phenylpiperazin-1-yl)-propyl)quinoline-8-sulfonamide
Type:
Small organic molecule
Emp. Form.:
C26H32N4O2S
Mol. Mass.:
464.623
SMILES:
O=S(=O)(N(CCCN1CCN(CC1)c1ccccc1)CC1CC1)c1cccc2cccnc12
: