Target
5-hydroxytryptamine receptor 7
Ligand
BDBM50306819
Substrate
Meas. Tech.
ChEMBL_608659 (CHEMBL1067145)
IC50
12.3±n/a nM
Citation
 Yoo, EYoon, JPae, ANRhim, HPark, WKKong, JYPark Choo, HY Synthesis and biological evaluation of (phenylpiperazinyl-propyl)arylsulfonamides as selective 5-HT(2A) receptor antagonists. Bioorg Med Chem 18:1665-75 (2010)  
Target
Name:
5-hydroxytryptamine receptor 7
Synonyms:
5-HT-7 5-HT7 5-HT7S 5HT7 HTR7 | Serotonin receptor 7
Type:
G Protein-Coupled Receptor (GPCR)
Mol. Mass.:
53573.08
Organism:
Homo sapiens (Human)
Description:
P34969
Residue:
479
  
Inhibitor
Name:
BDBM50306819
Synonyms:
CHEMBL602677 | N-(Cyclopropylmethyl)-N-(3-(4-(2-methoxyphenyl)-piperazin-1-yl)propyl)quinoline-8-sulfonamide
Type:
Small organic molecule
Emp. Form.:
C27H34N4O3S
Mol. Mass.:
494.649
SMILES:
COc1ccccc1N1CCN(CCCN(CC2CC2)S(=O)(=O)c2cccc3cccnc23)CC1
: