Target
5-hydroxytryptamine receptor 7
Ligand
BDBM50306821
Substrate
Meas. Tech.
ChEMBL_608659 (CHEMBL1067145)
IC50
35.3±n/a nM
Citation
 Yoo, EYoon, JPae, ANRhim, HPark, WKKong, JYPark Choo, HY Synthesis and biological evaluation of (phenylpiperazinyl-propyl)arylsulfonamides as selective 5-HT(2A) receptor antagonists. Bioorg Med Chem 18:1665-75 (2010)  
Target
Name:
5-hydroxytryptamine receptor 7
Synonyms:
5-HT-7 5-HT7 5-HT7S 5HT7 HTR7 | Serotonin receptor 7
Type:
G Protein-Coupled Receptor (GPCR)
Mol. Mass.:
53573.08
Organism:
Homo sapiens (Human)
Description:
P34969
Residue:
479
  
Inhibitor
Name:
BDBM50306821
Synonyms:
CHEMBL602889 | N-(Cyclopropylmethyl)-N-(3-(4-(4-fluorophenyl)piperazin-1-yl)propyl)quinoline-8-sulfonamid
Type:
Small organic molecule
Emp. Form.:
C26H31FN4O2S
Mol. Mass.:
482.613
SMILES:
Fc1ccc(cc1)N1CCN(CCCN(CC2CC2)S(=O)(=O)c2cccc3cccnc23)CC1
: