Target
5-hydroxytryptamine receptor 2A
Ligand
BDBM50306833
Substrate
Meas. Tech.
ChEMBL_608657 (CHEMBL1067143)
IC50
3.4±n/a nM
Citation
 Yoo, EYoon, JPae, ANRhim, HPark, WKKong, JYPark Choo, HY Synthesis and biological evaluation of (phenylpiperazinyl-propyl)arylsulfonamides as selective 5-HT(2A) receptor antagonists. Bioorg Med Chem 18:1665-75 (2010)  
Target
Name:
5-hydroxytryptamine receptor 2A
Synonyms:
5-HT-2 5-HT2A 5-hydroxytryptamine receptor 2A (5HT-2A) 5HT2A_HUMAN HTR2A | Serotonin receptor 2A
Type:
undefined
Mol. Mass.:
52607.65
Organism:
Homo sapiens (Human)
Description:
P28223
Residue:
471
  
Inhibitor
Name:
BDBM50306833
Synonyms:
CHEMBL605787 | N-(Cyclohexylmethyl)-N-(3-(4-(4-fluorophenyl)piperazin-1-yl)propyl)-4-methoxybenzenesulfonamide
Type:
Small organic molecule
Emp. Form.:
C27H38FN3O3S
Mol. Mass.:
503.672
SMILES:
COc1ccc(cc1)S(=O)(=O)N(CCCN1CCN(CC1)c1ccc(F)cc1)CC1CCCCC1
: